Reaction Details
TargetMetabotropic glutamate receptor 4
LigandBDBM55093
Substrate/Competitorn/a
Meas. Tech.Modulation of the Metabotropic Glutamate Receptor mGluR4: Potency at human mGluR4
EC50 154.385185±n/a nM
Citation PubChem, PC Modulation of the Metabotropic Glutamate Receptor mGluR4: Potency at human mGluR4 PubChem Bioassay(2010)[AID]
 
Metabotropic glutamate receptor 4
Name:Metabotropic glutamate receptor 4
Type:Protein
Mol. Mass.:101899.95
Organism:Homo sapiens (Human)
Description:Q14833
Residue:912
BDBM55093
NameBDBM55093
Synonyms:N-[3-chloro-4-(1,3-diketo-2-azaspiro[4.5]decan-2-yl)phenyl]picolinamide N-[3-chloro-4-(1,3-dioxo-2-azaspiro[4.5]decan-2-yl)phenyl]pyridine-2-carboxamide VU0400193-3 | cid_46869951
TypeSmall organic molecule
Emp. Form.C21H20ClN3O3
Mol. Mass.397.855
SMILESClc1cc(NC(=O)c2ccccn2)ccc1N1C(=O)CC2(CCCCC2)C1=O