Reaction Details
TargetKallikrein-5
LigandBDBM32755
Substrate/Competitorn/a
Meas. Tech.Kallikrein 5 1536 HTS Dose Response Confirmation
IC50 7436.3±n/a nM
Citation PubChem, PC Kallikrein 5 1536 HTS Dose Response Confirmation PubChem Bioassay(2008)[AID]
 
Kallikrein-5
Name:Kallikrein-5
Type:PROTEIN
Mol. Mass.:32031.72
Organism:Homo sapiens (Human)
Description:EBI_12584
Residue:293
BDBM32755
NameBDBM32755
Synonyms:2-thiophenecarboxylic acid [5-amino-1-(4-methylphenyl)sulfonyl-3-pyrazolyl] ester MLS000033863 Thiophene-2-carboxylic acid 5-amino-1-(toluene-4-sulfonyl)-1H-pyrazol-3-yl ester [5-azanyl-1-(4-methylphenyl)sulfonyl-pyrazol-3-yl] thiophene-2-carboxylate thiophene-2-carboxylic acid (5-amino-1-tosyl-pyrazol-3-yl) ester
TypeSmall organic molecule
Emp. Form.C15H13N3O4S2
Mol. Mass.363.411
SMILESCc1ccc(cc1)S(=O)(=O)n1nc(OC(=O)c2cccs2)cc1N