Reaction Details
TargetKallikrein-5
LigandBDBM32713
Substrate/Competitorn/a
Meas. Tech.Kallikrein 5 1536 HTS Dose Response Confirmation
IC50 2220.22±n/a nM
Citation PubChem, PC Kallikrein 5 1536 HTS Dose Response Confirmation PubChem Bioassay(2008)[AID]
 
Kallikrein-5
Name:Kallikrein-5
Type:PROTEIN
Mol. Mass.:32031.72
Organism:Homo sapiens (Human)
Description:EBI_12584
Residue:293
BDBM32713
NameBDBM32713
Synonyms:(3-amino-1,2,4-triazol-4-yl)-(4-methylphenyl)methanone (3-azanyl-1,2,4-triazol-4-yl)-(4-methylphenyl)methanone MLS000537289 cid_892616
TypeSmall organic molecule
Emp. Form.C10H10N4O
Mol. Mass.202.2126
SMILESCc1ccc(cc1)C(=O)n1cnnc1N