Reaction Details
TargetKallikrein-5
LigandBDBM32832
Substrate/Competitorn/a
Meas. Tech.Kallikrein 5 1536 HTS Dose Response Confirmation
IC50 832.94±n/a nM
Citation PubChem, PC Kallikrein 5 1536 HTS Dose Response Confirmation PubChem Bioassay(2008)[AID]
 
Kallikrein-5
Name:Kallikrein-5
Type:PROTEIN
Mol. Mass.:32031.72
Organism:Homo sapiens (Human)
Description:EBI_12584
Residue:293
BDBM32832
NameBDBM32832
Synonyms:(4-methylphenyl)-(5-methylsulfanyl-3-phenyl-1,2,4-triazol-1-yl)methanone MLS000545913 [5-(methylthio)-3-phenyl-1,2,4-triazol-1-yl]-(p-tolyl)methanone methyl1-(4-methylbenzoyl)-3-phenyl-1H-1,2,4-triazol-5-ylsulfide
TypeSmall organic molecule
Emp. Form.C17H15N3OS
Mol. Mass.309.386
SMILESCSc1nc(nn1C(=O)c1ccc(C)cc1)-c1ccccc1