Reaction Details
TargetKallikrein-5
LigandBDBM33716
Substrate/Competitorn/a
Meas. Tech.Kallikrein 5 1536 HTS Dose Response Confirmation
IC50 1504.36±n/a nM
Citation PubChem, PC Kallikrein 5 1536 HTS Dose Response Confirmation PubChem Bioassay(2008)[AID]
 
Kallikrein-5
Name:Kallikrein-5
Type:PROTEIN
Mol. Mass.:32031.72
Organism:Homo sapiens (Human)
Description:EBI_12584
Residue:293
BDBM33716
NameBDBM33716
Synonyms:2-[(5-benzamido-1H-1,2,4-triazol-3-yl)thio]acetic acid ethyl ester SMR000180812 ethyl 2-[(5-benzamido-1H-1,2,4-triazol-3-yl)sulfanyl]acetate ethyl 2-{[3-(benzoylamino)-1H-1,2,4-triazol-5-yl]sulfanyl}acetate
TypeSmall organic molecule
Emp. Form.C13H14N4O3S
Mol. Mass.306.34
SMILESCCOC(=O)CSc1nnc(NC(=O)c2ccccc2)[nH]1