Reaction Details
TargetKallikrein-5
LigandBDBM45578
Substrate/Competitorn/a
Meas. Tech.Kallikrein 5 1536 HTS Dose Response Confirmation
IC50 366.33±n/a nM
Citation PubChem, PC Kallikrein 5 1536 HTS Dose Response Confirmation PubChem Bioassay(2008)[AID]
 
Kallikrein-5
Name:Kallikrein-5
Type:PROTEIN
Mol. Mass.:32031.72
Organism:Homo sapiens (Human)
Description:EBI_12584
Residue:293
BDBM45578
NameBDBM45578
Synonyms:6,7-dimethoxy-2-[(2-nitrophenoxy)methyl]-3,1-benzoxazin-4-one MLS000663920 cid_1312679
TypeSmall organic molecule
Emp. Form.C17H14N2O7
Mol. Mass.358.3023
SMILESCOc1cc2nc(COc3ccccc3[N+]([O-])=O)oc(=O)c2cc1OC