Reaction Details
TargetKallikrein-5
LigandBDBM33000
Substrate/Competitorn/a
Meas. Tech.Kallikrein 5 1536 HTS Dose Response Confirmation
IC50 888.71±n/a nM
Citation PubChem, PC Kallikrein 5 1536 HTS Dose Response Confirmation PubChem Bioassay(2008)[AID]
 
Kallikrein-5
Name:Kallikrein-5
Type:PROTEIN
Mol. Mass.:32031.72
Organism:Homo sapiens (Human)
Description:EBI_12584
Residue:293
BDBM33000
NameBDBM33000
Synonyms:3H-Benzoimidazole-5-carboxylic acid [1-(2-nitro-phenyl)-meth-(E)-ylidene]-hydrazide N-[(2-nitrobenzylidene)amino]-3H-benzimidazole-5-carboxamide SMR000431332 | cid_947659
TypeSmall organic molecule
Emp. Form.C15H11N5O3
Mol. Mass.309.2795
SMILES[O-][N+](=O)c1ccccc1C=NNC(=O)c1ccc2nc[nH]c2c1