Reaction Details
TargetKallikrein-5
LigandBDBM33004
Substrate/Competitorn/a
Meas. Tech.Kallikrein 5 1536 HTS Dose Response Confirmation
IC50 882.91±n/a nM
Citation PubChem, PC Kallikrein 5 1536 HTS Dose Response Confirmation PubChem Bioassay(2008)[AID]
 
Kallikrein-5
Name:Kallikrein-5
Type:PROTEIN
Mol. Mass.:32031.72
Organism:Homo sapiens (Human)
Description:EBI_12584
Residue:293
BDBM33004
NameBDBM33004
Synonyms:2-(2-Bromo-phenyl)-6-methyl-thieno[2,3-d][1,3]oxazin-4-one 2-(2-bromophenyl)-6-methyl-thieno[2,3-d][1,3]oxazin-4-one MLS000767779 cid_3796366
TypeSmall organic molecule
Emp. Form.C13H8BrNO2S
Mol. Mass.322.177
SMILESCc1cc2c(nc(oc2=O)-c2ccccc2Br)s1