Reaction Details
TargetDNA repair protein RAD51 homolog 1
LigandBDBM56825
Substrate/Competitorn/a
Meas. Tech.Homologous Recombination - Rad 51_Dose response
IC50 42500±n/a nM
Citation PubChem, PC Homologous Recombination - Rad 51_Dose response PubChem Bioassay(2008)[AID]
 
DNA repair protein RAD51 homolog 1
Name:DNA repair protein RAD51 homolog 1
Type:Enzyme Catalytic Domain
Mol. Mass.:36960.74
Organism:Homo sapiens (Human)
Description:gi_49168602
Residue:339
BDBM56825
NameBDBM56825
Synonyms:1-Pyrimidin-2-yl-piperidine-4-carboxylic acid (2,5-diethoxy-phenyl)-amide N-(2,5-diethoxyphenyl)-1-(2-pyrimidinyl)-4-piperidinecarboxamide N-(2,5-diethoxyphenyl)-1-pyrimidin-2-yl-piperidine-4-carboxamide SMR000006972 | cid_649572
TypeSmall organic molecule
Emp. Form.C20H26N4O3
Mol. Mass.370.4454
SMILESCCOc1ccc(OCC)c(NC(=O)C2CCN(CC2)c2ncccn2)c1