Reaction Details
TargetDNA repair protein RAD51 homolog 1
LigandBDBM56832
Substrate/Competitorn/a
Meas. Tech.Homologous Recombination - Rad 51_Dose response
IC50 85000±n/a nM
Citation PubChem, PC Homologous Recombination - Rad 51_Dose response PubChem Bioassay(2008)[AID]
 
DNA repair protein RAD51 homolog 1
Name:DNA repair protein RAD51 homolog 1
Type:Enzyme Catalytic Domain
Mol. Mass.:36960.74
Organism:Homo sapiens (Human)
Description:gi_49168602
Residue:339
BDBM56832
NameBDBM56832
Synonyms:3-methyl-2,5,6,7-tetrahydroindazol-4-one SMR000038253 | cid_657436
TypeSmall organic molecule
Emp. Form.C8H10N2O
Mol. Mass.150.1778
SMILESCc1[nH]nc2CCCC(=O)c12