Reaction Details
TargetDNA repair protein RAD51 homolog 1
LigandBDBM56848
Substrate/Competitorn/a
Meas. Tech.Homologous Recombination - Rad 51_Dose response
IC50 85000±n/a nM
Citation PubChem, PC Homologous Recombination - Rad 51_Dose response PubChem Bioassay(2008)[AID]
 
DNA repair protein RAD51 homolog 1
Name:DNA repair protein RAD51 homolog 1
Type:Enzyme Catalytic Domain
Mol. Mass.:36960.74
Organism:Homo sapiens (Human)
Description:gi_49168602
Residue:339
BDBM56848
NameBDBM56848
Synonyms:2-(4-methoxyphenyl)-5-(prop-2-enylamino)-1,3-oxazole-4-carbonitrile 5-(allylamino)-2-(4-methoxyphenyl)-1,3-oxazole-4-carbonitrile MLS000062348 cid_2941177
TypeSmall organic molecule
Emp. Form.C14H13N3O2
Mol. Mass.255.2719
SMILESCOc1ccc(cc1)-c1nc(C#N)c(NCC=C)o1