Reaction Details
TargetDNA repair protein RAD51 homolog 1
LigandBDBM43830
Substrate/Competitorn/a
Meas. Tech.Homologous Recombination - Rad 51_Dose response
IC50 85000±n/a nM
Citation PubChem, PC Homologous Recombination - Rad 51_Dose response PubChem Bioassay(2008)[AID]
 
DNA repair protein RAD51 homolog 1
Name:DNA repair protein RAD51 homolog 1
Type:Enzyme Catalytic Domain
Mol. Mass.:36960.74
Organism:Homo sapiens (Human)
Description:gi_49168602
Residue:339
BDBM43830
NameBDBM43830
Synonyms:5-(amoxymethyl)-3-[2-[(4-phenylthiazol-2-yl)hydrazono]propyl]tetrahydrofuran-2-one 5-(pentoxymethyl)-3-[2-[(4-phenyl-2-thiazolyl)hydrazinylidene]propyl]-2-oxolanone Glucosamine derivative, 3 SMR000174499 | cid_2865032
TypeSmall organic molecule
Emp. Form.C22H29N3O3S
Mol. Mass.415.549
SMILESCCCCCOCC1CC(CC(C)N=Nc2nc(cs2)-c2ccccc2)C(=O)O1