Reaction Details
TargetDNA repair protein RAD51 homolog 1
LigandBDBM43835
Substrate/Competitorn/a
Meas. Tech.Homologous Recombination - Rad 51_Dose response
IC50 42500±n/a nM
Citation PubChem, PC Homologous Recombination - Rad 51_Dose response PubChem Bioassay(2008)[AID]
 
DNA repair protein RAD51 homolog 1
Name:DNA repair protein RAD51 homolog 1
Type:Enzyme Catalytic Domain
Mol. Mass.:36960.74
Organism:Homo sapiens (Human)
Description:gi_49168602
Residue:339
BDBM43835
NameBDBM43835
Synonyms:Glucosamine derivative, 8 N-cyclohexyl-5-nitro-2-(1-piperidinyl)benzamide N-cyclohexyl-5-nitro-2-piperidin-1-ylbenzamide SMR000200900 | cid_2967968
TypeSmall organic molecule
Emp. Form.C18H25N3O3
Mol. Mass.331.4094
SMILES[O-][N+](=O)c1ccc(N2CCCCC2)c(c1)C(=O)NC1CCCCC1