Reaction Details
TargetStreptokinase A
LigandBDBM31040
Substrate/Competitorn/a
Meas. Tech.Absorbance Microorganism-Based Dose Response HTS to Identify Inhibitors of Streptokinase Expression
EC50 150000±n/a nM
Citation PubChem, PC Absorbance Microorganism-Based Dose Response HTS to Identify Inhibitors of Streptokinase Expression PubChem Bioassay(2009)[AID]
 
Streptokinase A
Name:Streptokinase A
Type:Enzyme Catalytic Domain
Mol. Mass.:49924.80
Organism:Streptococcus pyogenes M1 GAS
Description:gi_15675770
Residue:440
BDBM31040
NameBDBM31040
Synonyms:1-Ethyl-6-methyl-3-phenyl-1H-pyrimido[5,4-e][1,2,4]triazine-5,7-dione 1-ethyl-6-methyl-3-phenyl-pyrimido[5,4-e][1,2,4]triazine-5,7-quinone MLS000027832 US9073941, 602 | cid_647501
TypeSmall organic molecule
Emp. Form.C14H13N5O2
Mol. Mass.283.2853
SMILESCCn1nc(nc2c1nc(=O)n(C)c2=O)-c1ccccc1