Reaction Details
TargetStreptokinase A
LigandBDBM33066
Substrate/Competitorn/a
Meas. Tech.Absorbance Microorganism-Based Dose Response HTS to Identify Inhibitors of Streptokinase Expression
EC50 150000±n/a nM
Citation PubChem, PC Absorbance Microorganism-Based Dose Response HTS to Identify Inhibitors of Streptokinase Expression PubChem Bioassay(2009)[AID]
 
Streptokinase A
Name:Streptokinase A
Type:Enzyme Catalytic Domain
Mol. Mass.:49924.80
Organism:Streptococcus pyogenes M1 GAS
Description:gi_15675770
Residue:440
BDBM33066
NameBDBM33066
Synonyms:2,5-bis(chloranyl)-3-[2-(dimethylamino)-1,3-thiazol-5-yl]-6-pyrrolidin-1-yl-cyclohexa-2,5-diene-1,4-dione 2,5-dichloro-3-[2-(dimethylamino)-1,3-thiazol-5-yl]-6-pyrrolidin-1-ylcyclohexa-2,5-diene-1,4-dione 2,5-dichloro-3-[2-(dimethylamino)thiazol-5-yl]-6-pyrrolidino-p-benzoquinone SMR000115102 | cid_1002248
TypeSmall organic molecule
Emp. Form.C15H15Cl2N3O2S
Mol. Mass.372.27
SMILESCN(C)c1ncc(s1)C1=C(Cl)C(=O)C(N2CCCC2)=C(Cl)C1=O