Reaction Details
TargetStreptokinase A
LigandBDBM57190
Substrate/Competitorn/a
Meas. Tech.Absorbance Microorganism-Based Dose Response HTS to Identify Inhibitors of Streptokinase Expression
EC50 9859±n/a nM
Citation PubChem, PC Absorbance Microorganism-Based Dose Response HTS to Identify Inhibitors of Streptokinase Expression PubChem Bioassay(2009)[AID]
 
Streptokinase A
Name:Streptokinase A
Type:Enzyme Catalytic Domain
Mol. Mass.:49924.80
Organism:Streptococcus pyogenes M1 GAS
Description:gi_15675770
Residue:440
BDBM57190
NameBDBM57190
Synonyms:(6Z)-6-[4-(4-chlorophenyl)-5-methyl-1,2-dihydropyrazol-3-ylidene]-3-methoxy-1-cyclohexa-2,4-dienone (6Z)-6-[4-(4-chlorophenyl)-5-methyl-1,2-dihydropyrazol-3-ylidene]-3-methoxycyclohexa-2,4-dien-1-one 2-[4-(4-Chloro-phenyl)-5-methyl-1H-pyrazol-3-yl]-5-methoxy-phenol SMR000145663 | cid_5423869
TypeSmall organic molecule
Emp. Form.C17H15ClN2O2
Mol. Mass.314.766
SMILESCOc1ccc(-c2n[nH]c(C)c2-c2ccc(Cl)cc2)c(O)c1