Reaction Details
TargetStreptokinase A
LigandBDBM45519
Substrate/Competitorn/a
Meas. Tech.Absorbance Microorganism-Based Dose Response HTS to Identify Inhibitors of Streptokinase Expression
EC50 9401±n/a nM
Citation PubChem, PC Absorbance Microorganism-Based Dose Response HTS to Identify Inhibitors of Streptokinase Expression PubChem Bioassay(2009)[AID]
 
Streptokinase A
Name:Streptokinase A
Type:Enzyme Catalytic Domain
Mol. Mass.:49924.80
Organism:Streptococcus pyogenes M1 GAS
Description:gi_15675770
Residue:440
BDBM45519
NameBDBM45519
Synonyms:2-(2,4-dimethylphenyl)-N-(4-{[(5-methyl-3-isoxazolyl)amino]sulfonyl}phenyl)-4-quinolinecarboxamide 2-(2,4-dimethylphenyl)-N-[4-[(5-methyl-3-isoxazolyl)sulfamoyl]phenyl]-4-quinolinecarboxamide MLS000540783 cid_1011349
TypeSmall organic molecule
Emp. Form.C28H24N4O4S
Mol. Mass.512.58
SMILESCc1cc(NS(=O)(=O)c2ccc(NC(=O)c3cc(nc4ccccc34)-c3ccc(C)cc3C)cc2)no1