Reaction Details
TargetStreptokinase A
LigandBDBM33150
Substrate/Competitorn/a
Meas. Tech.Absorbance Microorganism-Based Dose Response HTS to Identify Inhibitors of Streptokinase Expression
EC50 150000±n/a nM
Citation PubChem, PC Absorbance Microorganism-Based Dose Response HTS to Identify Inhibitors of Streptokinase Expression PubChem Bioassay(2009)[AID]
 
Streptokinase A
Name:Streptokinase A
Type:Enzyme Catalytic Domain
Mol. Mass.:49924.80
Organism:Streptococcus pyogenes M1 GAS
Description:gi_15675770
Residue:440
BDBM33150
NameBDBM33150
Synonyms:3-[(E)-3-(2,4-dimethylphenyl)-1-oxoprop-2-enyl]-2-hydroxy-1-cyclohepta-2,4,6-trienone 3-[(E)-3-(2,4-dimethylphenyl)prop-2-enoyl]-2-hydroxycyclohepta-2,4,6-trien-1-one 3-[3-(2,4-dimethylphenyl)acryloyl]-2-hydroxy-2,4,6-cycloheptatrien-1-one SMR000229842 | cid_7314606
TypeSmall organic molecule
Emp. Form.C18H16O3
Mol. Mass.280.3178
SMILESCc1ccc(\C=C\C(=O)c2ccccc(=O)c2O)c(C)c1