Reaction Details
TargetStreptokinase A
LigandBDBM58058
Substrate/Competitorn/a
Meas. Tech.Absorbance Microorganism-Based Dose Response HTS to Identify Inhibitors of Streptokinase Expression
EC50 150000±n/a nM
Citation PubChem, PC Absorbance Microorganism-Based Dose Response HTS to Identify Inhibitors of Streptokinase Expression PubChem Bioassay(2009)[AID]
 
Streptokinase A
Name:Streptokinase A
Type:Enzyme Catalytic Domain
Mol. Mass.:49924.80
Organism:Streptococcus pyogenes M1 GAS
Description:gi_15675770
Residue:440
BDBM58058
NameBDBM58058
Synonyms:2-methyl-3-[[(E)-(1-oxidanylidenenaphthalen-2-ylidene)methyl]amino]quinazolin-4-one 2-methyl-3-[[(E)-(1-oxonaphthalen-2-ylidene)methyl]amino]quinazolin-4-one 3-{[1-(1-Hydroxy-naphthalen-2-yl)-meth-(E)-ylidene]-amino}-2-methyl-3H-quinazolin-4-one SMR000413723 | cid_5423268
TypeSmall organic molecule
Emp. Form.C20H15N3O2
Mol. Mass.329.352
SMILESCc1nc2ccccc2c(=O)n1N=Cc1ccc2ccccc2c1O