Reaction Details
TargetStreptokinase A
LigandBDBM58060
Substrate/Competitorn/a
Meas. Tech.Absorbance Microorganism-Based Dose Response HTS to Identify Inhibitors of Streptokinase Expression
EC50 3803±n/a nM
Citation PubChem, PC Absorbance Microorganism-Based Dose Response HTS to Identify Inhibitors of Streptokinase Expression PubChem Bioassay(2009)[AID]
 
Streptokinase A
Name:Streptokinase A
Type:Enzyme Catalytic Domain
Mol. Mass.:49924.80
Organism:Streptococcus pyogenes M1 GAS
Description:gi_15675770
Residue:440
BDBM58060
NameBDBM58060
Synonyms:(3Z)-2-(4-tert-butyl-1-pyridin-1-iumyl)-4-oxo-3-thiophen-2-ylsulfonylimino-1-naphthalenolate (3Z)-2-(4-tert-butylpyridin-1-ium-1-yl)-4-oxidanylidene-3-thiophen-2-ylsulfonylimino-naphthalen-1-olate MLS000768828 cid_16412603
TypeSmall organic molecule
Emp. Form.C23H20N2O4S2
Mol. Mass.452.546
SMILESCC(C)(C)c1cc[n+](cc1)C1=C([N-]S(=O)(=O)c2cccs2)C(=O)c2ccccc2C1=O