Reaction Details
TargetStreptokinase A
LigandBDBM58068
Substrate/Competitorn/a
Meas. Tech.Absorbance Microorganism-Based Dose Response HTS to Identify Inhibitors of Streptokinase Expression
EC50 150000±n/a nM
Citation PubChem, PC Absorbance Microorganism-Based Dose Response HTS to Identify Inhibitors of Streptokinase Expression PubChem Bioassay(2009)[AID]
 
Streptokinase A
Name:Streptokinase A
Type:Enzyme Catalytic Domain
Mol. Mass.:49924.80
Organism:Streptococcus pyogenes M1 GAS
Description:gi_15675770
Residue:440
BDBM58068
NameBDBM58068
Synonyms:(5-tert-Butyl-2-methyl-3-phenyl-pyrazolo[1,5-a]pyrimidin-7-yl)-pyridin-2-ylmethyl-amine 5-tert-butyl-2-methyl-3-phenyl-N-(2-pyridinylmethyl)-7-pyrazolo[1,5-a]pyrimidinamine MLS000559937 cid_1983011
TypeSmall organic molecule
Emp. Form.C23H25N5
Mol. Mass.371.4781
SMILESCc1nn2c(NCc3ccccn3)cc(nc2c1-c1ccccc1)C(C)(C)C