Reaction Details
TargetStreptokinase A
LigandBDBM50633
Substrate/Competitorn/a
Meas. Tech.Absorbance Microorganism-Based Dose Response HTS to Identify Inhibitors of Streptokinase Expression
EC50 150000±n/a nM
Citation PubChem, PC Absorbance Microorganism-Based Dose Response HTS to Identify Inhibitors of Streptokinase Expression PubChem Bioassay(2009)[AID]
 
Streptokinase A
Name:Streptokinase A
Type:Enzyme Catalytic Domain
Mol. Mass.:49924.80
Organism:Streptococcus pyogenes M1 GAS
Description:gi_15675770
Residue:440
BDBM50633
NameBDBM50633
Synonyms:4-Methyl-N-{5-[(E)-2-methyl-3-phenyl-prop-2-en-(Z)-ylidene]-4-oxo-2-thioxo-thiazolidin-3-yl}-benzenesulf onamide 4-methyl-N-[(5Z)-5-[(E)-2-methyl-3-phenylprop-2-enylidene]-4-oxo-2-sulfanylidene-1,3-thiazolidin-3-yl]benzenesulfonamide MLS000778611 SMR000415405 | cid_2048896
TypeSmall organic molecule
Emp. Form.C20H18N2O3S3
Mol. Mass.430.564
SMILESC\C(\C=C1/SC(=S)N(NS(=O)(=O)c2ccc(C)cc2)C1=O)=C/c1ccccc1