Reaction Details
TargetStreptokinase A
LigandBDBM58076
Substrate/Competitorn/a
Meas. Tech.Absorbance Microorganism-Based Dose Response HTS to Identify Inhibitors of Streptokinase Expression
EC50 6954±n/a nM
Citation PubChem, PC Absorbance Microorganism-Based Dose Response HTS to Identify Inhibitors of Streptokinase Expression PubChem Bioassay(2009)[AID]
 
Streptokinase A
Name:Streptokinase A
Type:Enzyme Catalytic Domain
Mol. Mass.:49924.80
Organism:Streptococcus pyogenes M1 GAS
Description:gi_15675770
Residue:440
BDBM58076
NameBDBM58076
Synonyms:(5-Isopropyl-2-methyl-3-phenyl-pyrazolo[1,5-a]pyrimidin-7-yl)-pyridin-2-ylmethyl-amine 2-methyl-3-phenyl-5-propan-2-yl-N-(2-pyridinylmethyl)-7-pyrazolo[1,5-a]pyrimidinamine MLS000762881 cid_1966501
TypeSmall organic molecule
Emp. Form.C22H23N5
Mol. Mass.357.4515
SMILESCC(C)c1cc(NCc2ccccn2)n2nc(C)c(-c3ccccc3)c2n1