Reaction Details
TargetStreptokinase A
LigandBDBM58088
Substrate/Competitorn/a
Meas. Tech.Absorbance Microorganism-Based Dose Response HTS to Identify Inhibitors of Streptokinase Expression
EC50 150000±n/a nM
Citation PubChem, PC Absorbance Microorganism-Based Dose Response HTS to Identify Inhibitors of Streptokinase Expression PubChem Bioassay(2009)[AID]
 
Streptokinase A
Name:Streptokinase A
Type:Enzyme Catalytic Domain
Mol. Mass.:49924.80
Organism:Streptococcus pyogenes M1 GAS
Description:gi_15675770
Residue:440
BDBM58088
NameBDBM58088
Synonyms:(6Z)-6-[5-(4-chlorophenyl)-3-pyrazolidinylidene]-4-methyl-1-cyclohexa-2,4-dienone (6Z)-6-[5-(4-chlorophenyl)pyrazolidin-3-ylidene]-4-methylcyclohexa-2,4-dien-1-one MLS000807012 cid_5904485
TypeSmall organic molecule
Emp. Form.C16H15ClN2O
Mol. Mass.286.756
SMILESCc1ccc(O)c(c1)C1CC(N=N1)c1ccc(Cl)cc1