Reaction Details
TargetStreptokinase A
LigandBDBM58093
Substrate/Competitorn/a
Meas. Tech.Absorbance Microorganism-Based Dose Response HTS to Identify Inhibitors of Streptokinase Expression
EC50 150000±n/a nM
Citation PubChem, PC Absorbance Microorganism-Based Dose Response HTS to Identify Inhibitors of Streptokinase Expression PubChem Bioassay(2009)[AID]
 
Streptokinase A
Name:Streptokinase A
Type:Enzyme Catalytic Domain
Mol. Mass.:49924.80
Organism:Streptococcus pyogenes M1 GAS
Description:gi_15675770
Residue:440
BDBM58093
NameBDBM58093
Synonyms:3,3-bis(2-methyl-4-oxidanyl-5-propan-2-yl-phenyl)-2-benzofuran-1-one 3,3-bis(4-hydroxy-2-methyl-5-propan-2-ylphenyl)-2-benzofuran-1-one SMR000528039 cid_31316 | thymolphthalein
TypeSmall organic molecule
Emp. Form.C28H30O4
Mol. Mass.430.5354
SMILESCC(C)c1cc(c(C)cc1O)C1(OC(=O)c2ccccc12)c1cc(C(C)C)c(O)cc1C