Reaction Details
TargetLarge T antigen
LigandBDBM58949
Substrate/Competitorn/a
Meas. Tech.Identification of SV40 T antigen inhibitors: Cytotoxicity screen of selected hits
EC50>50000±n/a nM
Citation PubChem, PC Identification of SV40 T antigen inhibitors: Cytotoxicity screen of selected hits PubChem Bioassay(2009)[AID]
 
Large T antigen
Name:Large T antigen
Type:Enzyme Catalytic Domain
Mol. Mass.:81575.54
Organism:Simian virus 40
Description:P03070
Residue:708
BDBM58949
NameBDBM58949
Synonyms:MLS000033552 N-[4-(dimethylamino)phenyl]-2-[4-(4-fluorobenzoyl)piperidin-1-yl]acetamide N-[4-(dimethylamino)phenyl]-2-[4-(4-fluorophenyl)carbonylpiperidin-1-yl]ethanamide SMR000007080 | cid_656006
TypeSmall organic molecule
Emp. Form.C22H26FN3O2
Mol. Mass.383.4591
SMILESCN(C)c1ccc(NC(=O)CN2CCC(CC2)C(=O)c2ccc(F)cc2)cc1