Reaction Details
TargetLarge T antigen
LigandBDBM31751
Substrate/Competitorn/a
Meas. Tech.Identification of SV40 T antigen inhibitors: Cytotoxicity screen of selected hits
EC50 24610±n/a nM
Citation PubChem, PC Identification of SV40 T antigen inhibitors: Cytotoxicity screen of selected hits PubChem Bioassay(2009)[AID]
 
Large T antigen
Name:Large T antigen
Type:Enzyme Catalytic Domain
Mol. Mass.:81575.54
Organism:Simian virus 40
Description:P03070
Residue:708
BDBM31751
NameBDBM31751
Synonyms:3-[(2-chlorobenzyl)thio]-5,6-bis(2-furyl)-1,2,4-triazine 3-[(2-chlorophenyl)methylthio]-5,6-bis(2-furanyl)-1,2,4-triazine cid_6400942
TypeSmall organic molecule
Emp. Form.C18H12ClN3O2S
Mol. Mass.369.825
SMILESClc1ccccc1CSc1nnc(-c2ccco2)c(n1)-c1ccco1