Reaction Details
TargetThymidylate synthase
LigandBDBM18763
Substrate/Competitorn/a
Meas. Tech.Inhibition Assay
pH7±0
Temperature293.15±0 K
Ki 6e+2±n/a nM
Citation Ferrari, SCosti, PMWade, RC Inhibitor specificity via protein dynamics: insights from the design of antibacterial agents targeted against thymidylate synthase. Chem Biol10:1183-93 (2003) 
 
Thymidylate synthase
Name:Thymidylate synthase
Type:Enzyme
Mol. Mass.:30475.81
Organism:Escherichia coli
Description:n/a
Residue:264
BDBM18763
NameBDBM18763
Synonyms:1,8-naphthalein derivative, 10 A15 Alpha 156 | CHEMBL67116
TypeSmall organic molecule
Emp. Form.C24H14Cl2O4
Mol. Mass.437.272
SMILESOc1ccc(cc1Cl)C1(OC(=O)c2cccc3cccc1c23)c1ccc(O)c(Cl)c1