Reaction Details
TargetThymidylate synthase
LigandBDBM18772
Substrate/Competitorn/a
Meas. Tech.Inhibition Assay
pH7±0
Temperature293.15±0 K
Ki 4.1e+3±n/a nM
Citation Ferrari, SCosti, PMWade, RC Inhibitor specificity via protein dynamics: insights from the design of antibacterial agents targeted against thymidylate synthase. Chem Biol10:1183-93 (2003) 
 
Thymidylate synthase
Name:Thymidylate synthase
Type:Enzyme
Mol. Mass.:30475.81
Organism:Escherichia coli
Description:n/a
Residue:264
BDBM18772
NameBDBM18772
Synonyms:1,8-naphthalein derivative, 16 Phenolnaphthalein derivative, 2
TypeSmall organic molecule
Emp. Form.C24H13Br2ClO4
Mol. Mass.560.619
SMILESOc1ccc(cc1Br)C1(OC(=O)c2cccc3c(Cl)ccc1c23)c1ccc(O)c(Br)c1