Reaction Details
TargetBifunctional dihydrofolate reductase-thymidylate synthase
LigandBDBM18772
Substrate/Competitorn/a
Meas. Tech.Inhibition Assay
pH7±0
Temperature293.15±0 K
Ki>1.082e+6±n/a nM
Citation Ferrari, SCosti, PMWade, RC Inhibitor specificity via protein dynamics: insights from the design of antibacterial agents targeted against thymidylate synthase. Chem Biol10:1183-93 (2003) 
 
Bifunctional dihydrofolate reductase-thymidylate synthase
Name:Bifunctional dihydrofolate reductase-thymidylate synthase
Type:Protein
Mol. Mass.:58691.04
Organism:Leishmania major
Description:P07382
Residue:520
BDBM18772
NameBDBM18772
Synonyms:1,8-naphthalein derivative, 16 Phenolnaphthalein derivative, 2
TypeSmall organic molecule
Emp. Form.C24H13Br2ClO4
Mol. Mass.560.619
SMILESOc1ccc(cc1Br)C1(OC(=O)c2cccc3c(Cl)ccc1c23)c1ccc(O)c(Br)c1