Reaction Details
TargetThymidylate synthase
LigandBDBM18759
Substrate/Competitorn/a
Meas. Tech.Inhibition Assay
pH7±0
Temperature293.15±0 K
Ki 3.27e+4±n/a nM
Citation Ferrari, SCosti, PMWade, RC Inhibitor specificity via protein dynamics: insights from the design of antibacterial agents targeted against thymidylate synthase. Chem Biol10:1183-93 (2003) 
 
Thymidylate synthase
Name:Thymidylate synthase
Type:Enzyme
Mol. Mass.:34362.44
Organism:Pneumocystis carinii
Description:n/a
Residue:297
BDBM18759
NameBDBM18759
Synonyms:1,2-naphthalein derivative, 5 Phenolnaphthalein derivative, 5
TypeSmall organic molecule
Emp. Form.C24H12Br4O4
Mol. Mass.683.966
SMILESOc1c(Br)cc(cc1Br)C1(OC(=O)c2ccc3ccccc3c12)c1cc(Br)c(O)c(Br)c1