Reaction Details
TargetG1/S-specific cyclin-E1
LigandBDBM50277583
Substrate/Competitorn/a
Meas. Tech.Kinase Inhibition Assay
IC50 1.0e+3±n/a nM
Citation McInnes, CWang, SAnderson, SO'Boyle, JJackson, WKontopidis, GMeades, CMezna, MThomas, MWood, GLane, DPFischer, PM Structural determinants of CDK4 inhibition and design of selective ATP competitive inhibitors. Chem Biol11:525-34 (2004) 
 
G1/S-specific cyclin-E1
Name:G1/S-specific cyclin-E1
Type:Enzyme Subunit
Mol. Mass.:47073.17
Organism:Homo sapiens (Human)
Description:n/a
Residue:410
BDBM50277583
NameBDBM50277583
Synonyms:2-amino-4-methyl-1,3-thiazol-5-yl)-N-[4-(morpholin-4-yl)phenyl]pyrimidin-2-amine, 5 Aminopyrimidine, 9 CYC-116
TypeSmall organic molecule
Emp. Form.C18H20N6OS
Mol. Mass.368.456
SMILESCc1nc(N)sc1-c1ccnc(Nc2ccc(cc2)N2CCOCC2)n1