Reaction Details
TargetCyclin-dependent kinase 5 activator 1
LigandBDBM59110
Substrate/Competitorn/a
Meas. Tech.In Vitro Kinase Assay
pH7.2±0
IC50 1240±0 nM
Citation Wan, YHur, WCho, CYLiu, YAdrian, FJLozach, OBach, SMayer, TFabbro, DMeijer, LGray, NS Synthesis and target identification of hymenialdisine analogs. Chem Biol11:247-59 (2004) 
 
Cyclin-dependent kinase 5 activator 1
Name:Cyclin-dependent kinase 5 activator 1
Type:Enzyme Subunit
Mol. Mass.:34077.43
Organism:Homo sapiens (Human)
Description:Q15078
Residue:307
BDBM59110
NameBDBM59110
Synonyms:Hymenialdisine, 27e
TypeSmall organic molecule
Emp. Form.C16H15N5O4S
Mol. Mass.373.386
SMILESCS(=O)(=O)c1ccc2[nH]c3c(C(CCNC3=O)=C3NC(N)=NC3=O)c2c1