Reaction Details
TargetCyclin-dependent kinase 5 activator 1
LigandBDBM59121
Substrate/Competitorn/a
Meas. Tech.In Vitro Kinase Assay
pH7.2±0
IC50 3.80e+3±n/a nM
Citation Wan, YHur, WCho, CYLiu, YAdrian, FJLozach, OBach, SMayer, TFabbro, DMeijer, LGray, NS Synthesis and target identification of hymenialdisine analogs. Chem Biol11:247-59 (2004) 
 
Cyclin-dependent kinase 5 activator 1
Name:Cyclin-dependent kinase 5 activator 1
Type:Enzyme Subunit
Mol. Mass.:34077.43
Organism:Homo sapiens (Human)
Description:Q15078
Residue:307
BDBM59121
NameBDBM59121
Synonyms:Hymenialdisine, 28d
TypeSmall organic molecule
Emp. Form.C14H11Br2N5O3
Mol. Mass.457.077
SMILESBrc1[nH]c2c(c1Br)C(CCNC2=O)=NNc1ccc(cc1)N(=O)=O