Reaction Details
TargetCalmodulin-1
LigandBDBM59172
Substrate/Competitorn/a
Meas. Tech.Fluorescence spectroscopy
Kd 1e+1± 8 nM
Citation Trevitt, CRCraven, CJMilanesi, LSyson, KMattinen, MLPerkins, JAnnila, AHunter, CAWaltho, JP Enhanced ligand affinity for receptors in which components of the binding site are independently mobile. Chem Biol12:89-97 (2005) 
 
Calmodulin-1
Name:Calmodulin-1
Type:Protein
Mol. Mass.:16813.73
Organism:Human
Description:P0DP23
Residue:149
BDBM59172
NameBDBM59172
Synonyms:BN2
TypeSmall organic molecule
Emp. Form.C26H20N2O4S2
Mol. Mass.488.578
SMILESO=S(=O)(Nc1cccc(NS(=O)(=O)c2cccc3ccccc23)c1)c1cccc2ccccc12