Reaction Details
TargetAdenosine receptor A1
LigandBDBM50185934
Substrate/Competitorn/a
Meas. Tech.Binding Assay
Ki 171±15 nM
Citation Jacobson, KAOhno, MDuong, HTKim, SKTchilibon, SCesnek, MHolý, AGao, ZG A neoceptor approach to unraveling microscopic interactions between the human A2A adenosine receptor and its agonists. Chem Biol12:237-47 (2005) 
 
Adenosine receptor A1
Name:Adenosine receptor A1
Type:G Protein-Coupled Receptor (GPCR)
Mol. Mass.:36520.92
Organism:Homo sapiens (Human)
Description:P30542
Residue:326
BDBM50185934
NameBDBM50185934
Synonyms:(2S,3S,4R,5R)-5-(6-amino-9H-purin-9-yl)-3,4-dihydroxy-tetrahydrofuran-2-carbohydrazide CHEMBL378606
TypeSmall organic molecule
Emp. Form.C10H13N7O4
Mol. Mass.295.2547
SMILESNNC(=O)[C@H]1O[C@H]([C@H](O)[C@@H]1O)n1cnc2c(N)ncnc12