Reaction Details
TargetAdenosine receptor A3
LigandBDBM50080390
Substrate/Competitorn/a
Meas. Tech.Binding Assay
Ki 47.2±10.8 nM
Citation Jacobson, KAOhno, MDuong, HTKim, SKTchilibon, SCesnek, MHolý, AGao, ZG A neoceptor approach to unraveling microscopic interactions between the human A2A adenosine receptor and its agonists. Chem Biol12:237-47 (2005) 
 
Adenosine receptor A3
Name:Adenosine receptor A3
Type:G Protein-Coupled Receptor (GPCR)
Mol. Mass.:36197.32
Organism:Homo sapiens (Human)
Description:P0DMS8
Residue:318
BDBM50080390
NameBDBM50080390
Synonyms:(2R,3R,4S,5R)-2-(6-(2-methyl-benzylamino)-9H-purin-9-yl)-5-(hydroxymethyl)-tetrahydrofuran-3,4-diol Adenosine analog, 16 Metrifudil
TypeSmall organic molecule
Emp. Form.C18H21N5O4
Mol. Mass.371.3904
SMILESCc1ccccc1CNc1ncnc2n(cnc12)[C@@H]1O[C@H](CO)[C@@H](O)[C@H]1O