Reaction Details
TargetAdenosine receptor A3
LigandBDBM50163021
Substrate/Competitorn/a
Meas. Tech.Binding Assay
Ki 39.0±2.4 nM
Citation Jacobson, KAOhno, MDuong, HTKim, SKTchilibon, SCesnek, MHolý, AGao, ZG A neoceptor approach to unraveling microscopic interactions between the human A2A adenosine receptor and its agonists. Chem Biol12:237-47 (2005) 
 
Adenosine receptor A3
Name:Adenosine receptor A3
Type:G Protein-Coupled Receptor (GPCR)
Mol. Mass.:36197.32
Organism:Homo sapiens (Human)
Description:P0DMS8
Residue:318
BDBM50163021
NameBDBM50163021
Synonyms:(2R,3R,4S,5R)-2-(2-Amino-6-methylamino-purin-9-yl)-5-hydroxymethyl-tetrahydro-furan-3,4-diol CHEMBL194830
TypeSmall organic molecule
Emp. Form.C11H16N6O4
Mol. Mass.296.2825
SMILESCNc1nc(N)nc2n(cnc12)[C@@H]1O[C@H](CO)[C@@H](O)[C@H]1O