Reaction Details
TargetAlkaline phosphatase, tissue-nonspecific isozyme
LigandBDBM31772
Substrate/Competitorn/a
Meas. Tech.uHTS identification of compounds activating TNAP in the absence of phosphate acceptor performed in luminescent assay
EC50 70585±n/a nM
Citation PubChem, PC uHTS identification of compounds activating TNAP in the absence of phosphate acceptor performed in luminescent assay PubChem Bioassay(2009)[AID]
 
Alkaline phosphatase, tissue-nonspecific isozyme
Name:Alkaline phosphatase, tissue-nonspecific isozyme
Type:PROTEIN
Mol. Mass.:57306.17
Organism:Homo sapiens (Human)
Description:ChEMBL_1448917
Residue:524
BDBM31772
NameBDBM31772
Synonyms:1-[2-(2,4-dichlorobenzyl)oxy-2-(2,4-dichlorophenyl)ethyl]imidazole;nitric acid CHEMBL91 Miconazole US9144538, Miconazole Nitrate | cid_4189
TypeSmall organic molecule
Emp. Form.C18H14Cl4N2O
Mol. Mass.416.129
SMILESClc1ccc(COC(Cn2ccnc2)c2ccc(Cl)cc2Cl)c(Cl)c1