Reaction Details
TargetAlkaline phosphatase, tissue-nonspecific isozyme
LigandBDBM39713
Substrate/Competitorn/a
Meas. Tech.uHTS identification of compounds activating TNAP in the absence of phosphate acceptor performed in luminescent assay
EC50 195±n/a nM
Citation PubChem, PC uHTS identification of compounds activating TNAP in the absence of phosphate acceptor performed in luminescent assay PubChem Bioassay(2009)[AID]
 
Alkaline phosphatase, tissue-nonspecific isozyme
Name:Alkaline phosphatase, tissue-nonspecific isozyme
Type:PROTEIN
Mol. Mass.:57306.17
Organism:Homo sapiens (Human)
Description:ChEMBL_1448917
Residue:524
BDBM39713
NameBDBM39713
Synonyms:1'-allylspiro[1,2-dihydro-4,1,2-benzoxadiazine-3,3'-indoline]-2'-one 1'-prop-2-enylspiro[1,2-dihydro-4,1,2-benzoxadiazine-3,3'-indole]-2'-one SMR000153589 | cid_4879299
TypeSmall organic molecule
Emp. Form.C17H15N3O2
Mol. Mass.293.3199
SMILESC=CCN1C(=O)C2(NNc3ccccc3O2)c2ccccc12