Reaction Details
TargetM17 leucyl aminopeptidase
LigandBDBM59951
Substrate/Competitorn/a
Meas. Tech.Inhibitors of Plasmodium falciparum M17- Family Leucine Aminopeptidase (M17LAP)
IC50 1000±n/a nM
Citation PubChem, PC Inhibitors of Plasmodium falciparum M17- Family Leucine Aminopeptidase (M17LAP) PubChem Bioassay(2009)[AID]
 
M17 leucyl aminopeptidase
Name:M17 leucyl aminopeptidase
Synonyms:leucine aminopeptidase
Type:Enzyme Catalytic Domain
Mol. Mass.:67834.32
Organism:Plasmodium falciparum 3D7
Description:gi_124809582
Residue:605
BDBM59951
NameBDBM59951
TypeSmall organic molecule
Emp. Form.C23H24N2O5S
Mol. Mass.440.512
SMILESCOc1cc(NC(=O)CSc2nc3c(C)ccc(C)c3cc2C)c(cc1OC)C(O)=O