Reaction Details
TargetM17 leucyl aminopeptidase
LigandBDBM59953
Substrate/Competitorn/a
Meas. Tech.Inhibitors of Plasmodium falciparum M17- Family Leucine Aminopeptidase (M17LAP)
IC50 1570±n/a nM
Citation PubChem, PC Inhibitors of Plasmodium falciparum M17- Family Leucine Aminopeptidase (M17LAP) PubChem Bioassay(2009)[AID]
 
M17 leucyl aminopeptidase
Name:M17 leucyl aminopeptidase
Synonyms:leucine aminopeptidase
Type:Enzyme Catalytic Domain
Mol. Mass.:67834.32
Organism:Plasmodium falciparum 3D7
Description:gi_124809582
Residue:605
BDBM59953
NameBDBM59953
TypeSmall organic molecule
Emp. Form.C21H20N2O5S
Mol. Mass.412.459
SMILESCOc1cc(NC(=O)CSc2nc3ccccc3cc2C)c(cc1OC)C(O)=O