Reaction Details
TargetM17 leucyl aminopeptidase
LigandBDBM60057
Substrate/Competitorn/a
Meas. Tech.Inhibitors of Plasmodium falciparum M17- Family Leucine Aminopeptidase (M17LAP)
IC50 1450±n/a nM
Citation PubChem, PC Inhibitors of Plasmodium falciparum M17- Family Leucine Aminopeptidase (M17LAP) PubChem Bioassay(2009)[AID]
 
M17 leucyl aminopeptidase
Name:M17 leucyl aminopeptidase
Synonyms:leucine aminopeptidase
Type:Enzyme Catalytic Domain
Mol. Mass.:67834.32
Organism:Plasmodium falciparum 3D7
Description:gi_124809582
Residue:605
BDBM60057
NameBDBM60057
TypeSmall organic molecule
Emp. Form.C24H19N3O3S
Mol. Mass.429.491
SMILESOc1cc(=O)n(c(SCC(=O)Nc2ccc3CCc4cccc2c34)n1)-c1ccccc1