Reaction Details
TargetM17 leucyl aminopeptidase
LigandBDBM60084
Substrate/Competitorn/a
Meas. Tech.Inhibitors of Plasmodium falciparum M17- Family Leucine Aminopeptidase (M17LAP)
IC50 1000±n/a nM
Citation PubChem, PC Inhibitors of Plasmodium falciparum M17- Family Leucine Aminopeptidase (M17LAP) PubChem Bioassay(2009)[AID]
 
M17 leucyl aminopeptidase
Name:M17 leucyl aminopeptidase
Synonyms:leucine aminopeptidase
Type:Enzyme Catalytic Domain
Mol. Mass.:67834.32
Organism:Plasmodium falciparum 3D7
Description:gi_124809582
Residue:605
BDBM60084
NameBDBM60084
TypeSmall organic molecule
Emp. Form.C22H22N2O6S
Mol. Mass.442.485
SMILESCOc1ccc2nc(SCC(=O)Nc3cc(OC)c(OC)cc3C(O)=O)c(C)cc2c1