Reaction Details
TargetM17 leucyl aminopeptidase
LigandBDBM60130
Substrate/Competitorn/a
Meas. Tech.Inhibitors of Plasmodium falciparum M17- Family Leucine Aminopeptidase (M17LAP)
IC50 1000±n/a nM
Citation PubChem, PC Inhibitors of Plasmodium falciparum M17- Family Leucine Aminopeptidase (M17LAP) PubChem Bioassay(2009)[AID]
 
M17 leucyl aminopeptidase
Name:M17 leucyl aminopeptidase
Synonyms:leucine aminopeptidase
Type:Enzyme Catalytic Domain
Mol. Mass.:67834.32
Organism:Plasmodium falciparum 3D7
Description:gi_124809582
Residue:605
BDBM60130
NameBDBM60130
TypeSmall organic molecule
Emp. Form.C17H13Cl6NO5
Mol. Mass.524.007
SMILESCOc1ccc(OC)c(NC(=O)C2C(C(O)=O)C3(Cl)C(Cl)=C(Cl)C2(Cl)C3(Cl)Cl)c1