Reaction Details
TargetDual specificity protein phosphatase 3
LigandBDBM48833
Substrate/Competitorn/a
Meas. Tech.uHTS absorbance assay for the identification of compounds that inhibit VHR1.
IC50 3030±n/a nM
Citation PubChem, PC uHTS absorbance assay for the identification of compounds that inhibit VHR1. PubChem Bioassay(2009)[AID]
 
Dual specificity protein phosphatase 3
Name:Dual specificity protein phosphatase 3
Type:Hydrolase
Mol. Mass.:20480.58
Organism:Homo sapiens (Human)
Description:n/a
Residue:185
BDBM48833
NameBDBM48833
Synonyms:(5Z)-3-(3-chlorophenyl)-5-(4-hydroxy-3-methoxy-5-nitro-benzylidene)thiazolidine-2,4-quinone (5Z)-3-(3-chlorophenyl)-5-[(4-hydroxy-3-methoxy-5-nitrophenyl)methylidene]-1,3-thiazolidine-2,4-dione 3-(3-chlorophenyl)-5-(4-hydroxy-3-methoxy-5-nitrobenzylidene)-1,3-thiazolidine-2,4-dione SMR000298496 | cid_1231596
TypeSmall organic molecule
Emp. Form.C17H11ClN2O6S
Mol. Mass.406.797
SMILESCOc1cc(\C=C2/SC(=O)N(C2=O)c2cccc(Cl)c2)cc(c1O)[N+]([O-])=O