Reaction Details
TargetDual specificity protein phosphatase 3
LigandBDBM46229
Substrate/Competitorn/a
Meas. Tech.uHTS absorbance assay for the identification of compounds that inhibit VHR1.
IC50 1230±n/a nM
Citation PubChem, PC uHTS absorbance assay for the identification of compounds that inhibit VHR1. PubChem Bioassay(2009)[AID]
 
Dual specificity protein phosphatase 3
Name:Dual specificity protein phosphatase 3
Type:Hydrolase
Mol. Mass.:20480.58
Organism:Homo sapiens (Human)
Description:n/a
Residue:185
BDBM46229
NameBDBM46229
Synonyms:4-chloranyl-N-(3,4-dihydro-2H-thiochromen-4-yl)-3-sulfamoyl-benzamide 4-chloro-N-(3,4-dihydro-2H-1-benzothiopyran-4-yl)-3-sulfamoylbenzamide MLS-0336143.0001 | cid_16330874
TypeSmall organic molecule
Emp. Form.C16H15ClN2O3S2
Mol. Mass.382.885
SMILESNS(=O)(=O)c1cc(ccc1Cl)C(=O)NC1CCSc2ccccc12