Reaction Details
TargetDual specificity protein phosphatase 3
LigandBDBM51788
Substrate/Competitorn/a
Meas. Tech.uHTS absorbance assay for the identification of compounds that inhibit VHR1.
IC50 2280±n/a nM
Citation PubChem, PC uHTS absorbance assay for the identification of compounds that inhibit VHR1. PubChem Bioassay(2009)[AID]
 
Dual specificity protein phosphatase 3
Name:Dual specificity protein phosphatase 3
Type:Hydrolase
Mol. Mass.:20480.58
Organism:Homo sapiens (Human)
Description:n/a
Residue:185
BDBM51788
NameBDBM51788
Synonyms:5-[(2E)-2-(8-oxidanylidenequinolin-5-ylidene)hydrazinyl]naphthalene-1-sulfonic acid 5-[(2E)-2-(8-oxoquinolin-5-ylidene)hydrazinyl]naphthalene-1-sulfonic acid 5-[(N'E)-N'-(8-keto-5-quinolylidene)hydrazino]naphthalene-1-sulfonic acid SMR000555383 | cid_5876309
TypeSmall organic molecule
Emp. Form.C19H13N3O4S
Mol. Mass.379.389
SMILESOc1ccc(N=Nc2cccc3c(cccc23)S(O)(=O)=O)c2cccnc12