Reaction Details
TargetTyrosine-protein phosphatase non-receptor type 22
LigandBDBM54769
Substrate/Competitorn/a
Meas. Tech.uHTS identification of small molecule inhibitors of LYP via a fluorescence intensity assay
IC50 8816.962±n/a nM
Citation PubChem, PC uHTS identification of small molecule inhibitors of LYP via a fluorescence intensity assay PubChem Bioassay(2009)[AID]
 
Tyrosine-protein phosphatase non-receptor type 22
Name:Tyrosine-protein phosphatase non-receptor type 22
Type:n/a
Mol. Mass.:91712.31
Organism:Homo sapiens (Human)
Description:Q9Y2R2
Residue:807
BDBM54769
NameBDBM54769
Synonyms:4-({2-bromo-4-[(2,5-dioxo-4-imidazolidinylidene)methyl]-6-ethoxyphenoxy}methyl)benzoic acid 4-[[2-bromo-4-[(E)-(2,5-dioxo-4-imidazolidinylidene)methyl]-6-ethoxyphenoxy]methyl]benzoic acid 4-[[4-[(E)-[2,5-bis(oxidanylidene)imidazolidin-4-ylidene]methyl]-2-bromanyl-6-ethoxy-phenoxy]methyl]benzoic acid SMR000298732 | cid_1334608
TypeSmall organic molecule
Emp. Form.C20H17BrN2O6
Mol. Mass.461.263
SMILESCCOc1cc(\C=C2\NC(=O)NC2=O)cc(Br)c1OCc1ccc(cc1)C(O)=O