Reaction Details
TargetTyrosine-protein phosphatase non-receptor type 22
LigandBDBM75323
Substrate/Competitorn/a
Meas. Tech.uHTS identification of small molecule inhibitors of LYP via a fluorescence intensity assay
IC50 99000±n/a nM
Citation PubChem, PC uHTS identification of small molecule inhibitors of LYP via a fluorescence intensity assay PubChem Bioassay(2009)[AID]
 
Tyrosine-protein phosphatase non-receptor type 22
Name:Tyrosine-protein phosphatase non-receptor type 22
Type:n/a
Mol. Mass.:91712.31
Organism:Homo sapiens (Human)
Description:Q9Y2R2
Residue:807
BDBM75323
NameBDBM75323
Synonyms:2-[4-[[[4-[2-(4-chloroanilino)-1,3-thiazol-4-yl]benzoyl]hydrazinylidene]methyl]phenoxy]acetic acid 2-[4-[[[4-[2-[(4-chlorophenyl)amino]-1,3-thiazol-4-yl]phenyl]carbonylhydrazinylidene]methyl]phenoxy]ethanoic acid MLS000703184 cid_3143384
TypeSmall organic molecule
Emp. Form.C25H19ClN4O4S
Mol. Mass.506.961
SMILESOC(=O)COc1ccc(C=NNC(=O)c2ccc(cc2)-c2csc(Nc3ccc(Cl)cc3)n2)cc1